cccicl
cccicl
发布于 1个月前

Titanium [ERROR] ** BUILD FAILED ** [ERROR] The following build commands failed: [ERROR]

[ERROR] ** BUILD FAILED **
[ERROR] The following build commands failed:
[ERROR] CodeSign build/Products/Debug-iphoneos/foreman.app

解决: 发现app的描述文件状态为invalid,重新编辑下载使用即可.

©2020 edoou.com   京ICP备16001874号-3